{"text_format":"1","workbook":"xlsx","n_sheets":6,"sheets":["INSTRUCTIVO DE USO","PPII_YNC","OBLIGACIONES APLICABLES","Asuntos radicación","Temp","Hoja2"],"not_rendered":{"charts":0,"images":2,"macros":1,"external_links":0,"defined_names":4,"comments":1,"pivot_tables":0},"unopened":[],"bounds":{"document_bytes":16777216,"sheet_cells":100000,"rows_first":2000,"rows_last":500,"rows_between":2000,"halvings":0,"cell_chars":16384,"cell_head_chars":4096},"cells_cut":0,"cells_raw":0,"read":"whole","date_system":"1900"}

{"sheet":"INSTRUCTIVO DE USO","index":0,"n_rows":11,"n_cols":3,"rows_kept":11,"cut":false,"hidden":false,"merged":[[10,0,10,12],[0,0,0,1],[0,2,0,12],[2,0,2,12],[4,0,5,12],[7,0,8,12]]}
[null,null,"INSTRUCTIVO DE USO DEL INSTRUMENTO DE OBLIGACIONES MÍNIMAS "]
[]
["1. INTRODUCCIÓN\n\nLas Obligaciones Mínimas son un instrumento interno de la Autoridad Nacional de Licencias Ambientales – ANLA formulado con el fin de unificar criterios por parte de los profesionales que realizan la evaluación y seguimiento de proyectos, obras o actividades sujetos al trámite de licenciamiento ambiental, mediante la estandarización de obligaciones mínimas asociadas al acto administrativo a través del cual se otorga o modifica la licencia ambiental, se actualizan los planes de manejo ambiental y se imponen medidas adicionales, de tal manera que se asegure que en cada tipo de proyecto se impongan las mismas obligaciones estandarizadas bajo requerimientos legales y directrices institucionales, así como con condiciones unificadas y claramente definidas de modo, tiempo y lugar.\n\nEs importante resaltar que, este instrumento al ser interno facilita la labor de esta autoridad en la imposición de obligaciones mínimas en los procesos de evaluación y seguimiento (este último en los casos estrictamente aplicables), y en la verificación del cumplimiento de las mismas en el seguimiento. Sin embargo, al ser puesto a disposición de los usuarios o solicitantes de licencias ambientales servirá como herramienta de planeación de los proyectos, obras o actividades sujetos a licenciamiento, de tal manera que previo a la radicación de los estudios ambientales frente a esta autoridad, las obligaciones puedan ser incorporadas por los usuarios en la formulación de los Planes de Manejo Ambiental - PMA\n\nPor lo anterior, a continuación se realizan algunas precisiones a los solicitantes de licencias ambientales cuando estos deseen consultar y hacer uso de este instrumento durante el proceso de formulación de sus PMA."]
[]
["2. DEFINICIONES\n\nCondición de lugar: (dónde) lugares o puntos en los que debe desarrollarse la actividad según experticia del evaluador o según protocolos, guías, normativa en general, etc.\nCondición de modo: (cómo) descripción de las características o circunstancias en las que se deben realizar las actividades autorizadas, según protocolos, guías, normativa en general y aspectos administrativos que se definan.\nCondición de tiempo: (cuándo) periodicidad para la ejecución de monitoreos, tiempos de realización de actividades, tiempos de presentación de la información, etc.\nObligaciones mínimas: Describen las condiciones mínimas de modo, tiempo y lugar a través de las cuales la Autoridad Ambiental, autoriza la ejecución de un proyecto, obra o actividad sujeto legalmente al trámite de Licenciamiento Ambiental, identificando los permisos, autorizaciones y/o concesiones cuando sea el caso, de conformidad con cada subsector (tipo de proyecto). En razón a lo anterior, se clasifican las obligaciones mínimas, de conformidad con las características de las condiciones reglamentadas, de la siguiente manera: obligaciones de uso, aprovechamiento y/o afectación de recursos naturales, obligaciones asociadas a componentes y actividades, obligaciones asociadas a planes, obligaciones socioeconómicas, obligaciones generales y requisitos del acto administrativo. \nObligaciones de uso, aprovechamiento y/o afectación de recursos naturales: están relacionadas con las autorizaciones y/o permisos otorgados para el uso, aprovechamiento y/o afectación de los recursos naturales, tales como: emisiones atmosféricas, ruido, aprovechamiento forestal, concesión aguas subterráneas, exploración de aguas subterráneas, concesión aguas superficiales, ocupación de cauce, vertimiento en agua superficial, vertimiento en suelo, entre otras.\nObligaciones asociadas a componentes y actividades: contiene obligaciones relacionadas con algunos componentes y actividades propias del proyecto, obra o actividad, tales como: adecuación / construcción de vías existentes de apoyo al proyecto, almacenamiento de materiales de construcción, almacenamiento de combustibles y productos químicos, compra de agua, recirculación de agua residual, entrega de aguas residuales para reúso, entrega de aguas residuales a terceros, materiales de construcción, gestión de residuos, zonas de disposición de material sobrante de excavaciones, entre otras.\nObligaciones asociadas a Planes: contiene obligaciones relacionadas con la ejecución y cumplimiento de algunos planes definidos en la licencia ambiental de un proyecto, tales como: plan de compensación del medio biótico, plan de gestión del riesgo, plan de desmantelamiento y abandono y plan de inversión de no menos del 1%.\nObligaciones socioeconómicas: contienen obligaciones relacionadas con temas, tales como: gestión social y valoración económica.\nObligaciones generales: agrupa diferentes aspectos relacionados con cumplimiento de parámetros normativos, presentación de Informes de Cumplimiento Ambiental – ICA, notificaciones de cambios menores, solicitudes de modificación de licencia ambiental y demás condiciones generales a ser tenidas en cuenta por parte del titular de la licencia. La inclusión por parte de los profesionales jurídicos de este tipo de obligaciones, deberá realizarse en todas las licencias ambientales, sin importar el tipo de proyecto. En caso de que el solicitante de la licencia ambiental haga uso de este instrumento durante el proceso de formulación de su PMA, no deberá tener en cuenta este tipo de obligaciones dada la naturaleza de las mismas.\nRequisitos del acto administrativo: corresponde a aquellas obligaciones de la ANLA frente a cada licencia ambiental. La inclusión por parte de los profesionales jurídicos de este tipo de obligaciones deberá realizarse en todas las licencias ambientales, sin importar el tipo de proyecto. No tienen relación alguna con las fases de desarrollo del proyecto y no son objeto de seguimiento. Algunas de las obligaciones, contienen textos en rojo que deberán ser diligenciados directamente en el acto administrativo por el profesional jurídico, como: nombre y NIT del titular del proyecto. En caso de que el solicitante de la licencia ambiental haga uso de este instrumento durante el proceso de formulación de su PMA, no deberá tenerl en cuenta este tipo de obligaciones dada la naturaleza de las mismas."]
[]
{"$rows_left_out":6}
{"sheet":"PPII_YNC","index":1,"n_rows":206,"n_cols":11,"rows_kept":206,"cut":false,"hidden":false,"merged":[[6,1,7,1],[5,0,5,4],[6,3,7,3],[6,4,7,4],[0,0,4,1],[6,0,7,0],[0,6,1,6],[2,6,3,6],[5,5,5,9],[6,5,6,7],[6,8,7,8],[6,9,7,9],[0,7,1,10],[2,7,3,10],[4,7,4,10],[0,2,4,5],[6,2,7,2],[6,10,7,10]]}
[null,null,"OBLIGACIONES MÍNIMAS PARA PROYECTOS PILOTO DE INVESTIGACIÓN INTEGRAL - PPII SOBRE YACIMIENTOS NO CONVENCIONALES - YNC DE HIDROCARBUROS CON LA UTILIZACIÓN DE LA TÉCNICA DE FRACTURAMIENTO HIDRÁULICO MULTIETAPA CON PERFORACIÓN HORIZONTAL - FH-PH",null,null,null,"Fecha:","2022-08-10"]
[]
[null,null,null,null,null,null,"Versión:",2]
[]
[null,null,null,null,null,null,"Código:","EL-FO-41"]
["SECCIÓN 1. PERMISOS, AUTORIZACIONES Y ASPECTOS GENERALES",null,null,null,null,"SECCIÓN 2. FASE DEL PROYECTO PARA EL CUMPLIMIENTO Y SEGUIMIENTO A OBLIGACIONES",null,null,null,null,"SECCIÓN 3. TEMPORALIDAD"]
{"$rows_left_out":201}
{"sheet":"OBLIGACIONES APLICABLES","index":2,"n_rows":201,"n_cols":9,"rows_kept":201,"cut":false,"hidden":false,"merged":[[0,1,0,8],[1,0,2,0],[1,1,2,1],[1,2,2,2],[1,3,1,5],[1,6,2,6],[1,7,2,7],[1,8,2,8]]}
[null,"OBLIGACIONES MÍNIMAS APLICABLES AL PROYECTO, OBRA O ACTIVIDAD EN EVALUACIÓN / SEGUIMIENTO\nNota: Usar el texto de esta hoja para construir el concepto técnico y acto administrativo (Copiar y pegar en cada documento a construir)"]
["Aplica (si / no)","TEMÁTICA","OBLIGACIÓN ESTANDARIZADA","Etapa concomitante",null,null,"Etapa de evaluación","Desmantelamiento, abandono y restauración","Temporalidad"]
[null,null,null,"Pre-construcción","Construcción","Perforación, completamiento, fracturamiento hidráulico, dimensionamiento del yacimiento"]
[{"$f":"PPII_YNC!D9","v":0},{"$f":"PPII_YNC!B9","v":"AIRE"},{"$f":"PPII_YNC!E9","v":"Realizar monitoreo de las emisiones atmosféricas generadas en las fuentes puntuales del proyecto de conformidad con lo establecido en el Protocolo  de Control y Vigilancia de la Contaminación Atmosférica Generada por Fuentes Fijas (adoptado por la Resolución 760 de 2010 del MAVDT, ajustado por la Resolución 2153 de 2010, Resolución 591 de 2012, Resolución 1632 de 2012 y Resolución 1807 de 2012, o la norma que la modifique o sustituya), dando cumplimiento a las siguientes condiciones:\n\na) Para determinar la frecuencia de los monitoreos de emisiones atmosféricas asociadas a fuentes puntuales, realizar un monitoreo al inicio de la operación y dar cumplimiento a lo establecido en el numeral 3.2 y en la tabla No. 9 del Protocolo para el Control y Vigilancia de la Contaminación Atmosférica Generada por Fuentes Fijas. Presentar los resultados del monitoreo inicial, las frecuencias establecidas con su respectiva justificación (determinación de las UCA) y el cumplimiento de altura mínima de descarga de las fuentes autorizadas según el Protocolo en el primer Informe de Cumplimiento Ambiental - ICA. \nb) Medir en cada monitoreo de acuerdo con la actividad industrial realizada, los contaminantes establecidos en la Tabla 2 del Protocolo  de Control y Vigilancia de la Contaminación Atmosférica Generada por Fuentes Fijas, de acuerdo con las actividades desarrolladas por el proyecto en cada una de sus etapas.\nc) Las fuentes de emisión contarán con un sistema de extracción localizada, chimenea, plataforma y puertos de muestreo que permitan realizar la medición directa y demostrar el cumplimiento normativo. La plataforma, diámetro y localización de los puertos de muestreo, se construirán de acuerdo a los métodos y procedimientos adoptados en el Protocolo para el Control y Vigilancia de la Contaminación Atmosférica generada por fuentes fijas última versión.\nd) Entregar en los respectivos Informes de Cumplimiento Ambiental - ICA el informe de los resultados y análisis de las mediciones de emisiones (asociadas a fuentes fijas puntuales), cumpliendo con lo establecido en el numeral 2.2 del Protocolo en mención y empleando los formatos establecidos en el Anexo 2, 3 y 4 del mismo. En dicho informe se compararán las mediciones con los estándares establecidos en la Resolución 909 de 2008, o aquellas que la modifiquen o sustituyan, para los contaminantes de la Tabla 2 según el Protocolo. De sobrepasar los límites de emisión para cada contaminante, el titular de la licencia presentará, las medidas de manejo pertinentes, necesarias para garantizar el cumplimiento de los estándares, las cuales serán informadas en los Informes de Cumplimiento Ambiental - ICA."},{"$f":"PPII_YNC!F9","v":"N/A"},{"$f":"PPII_YNC!G9","v":"N/A"},{"$f":"PPII_YNC!H9","v":"Aplica"},{"$f":"PPII_YNC!I9","v":"N/A"},{"$f":"PPII_YNC!J9","v":"N/A"},{"$f":"PPII_YNC!K9","v":"Permanente"}]
[{"$f":"PPII_YNC!D10","v":0},{"$f":"PPII_YNC!B10","v":"AIRE"},{"$f":"PPII_YNC!E10","v":"Realizar el mantenimiento preventivo y correctivo de los sistemas de control de las fuentes de emisión, de conformidad con lo establecido en el  Protocolo  para el Control y Vigilancia de la Contaminación Atmosférica Generada por Fuentes Fijas (adoptado por la Resolución 760 de 2010 del MAVDT, ajustado por la Resolución 2153 de 2010, Resolución 591 de 2012, Resolución 1632 de 2012 y Resolución 1807 de 2012, o la norma que la modifique o sustituya) y presentar en los Informes de Cumplimiento Ambiental - ICA las evidencias de su implementación, así como la ficha técnica del fabricante, y la eficiencia de control relacionando el respectivo equipo contaminante."},{"$f":"PPII_YNC!F10","v":"N/A"},{"$f":"PPII_YNC!G10","v":"N/A"},{"$f":"PPII_YNC!H10","v":"Aplica"},{"$f":"PPII_YNC!I10","v":"N/A"},{"$f":"PPII_YNC!J10","v":"N/A"},{"$f":"PPII_YNC!K10","v":"Permanente"}]
[{"$f":"PPII_YNC!D11","v":0},{"$f":"PPII_YNC!B11","v":"AIRE"},{"$f":"PPII_YNC!E11","v":"Actualizar el inventario de emisiones atmosféricas generadas por el proyecto como mínimo una vez al año o cada vez que se presenten cambios en los procesos y/o actividades que generan emisiones (por ejemplo, introducción de nuevas fuentes), teniendo en cuenta lo siguiente:\n\na) Para las fuentes fijas puntuales que cuenten con las condiciones técnicas de medición, realizar la estimación de emisiones a partir de medición directa, dando cumplimiento a los criterios establecidos en el Protocolo para el Control y Vigilancia de la Contaminación Atmosférica Generada por Fuentes Fijas (adoptado por la Resolución 760 de 2010 del MAVDT, ajustado por la Resolución 2153 de 2010, Resolución 591 de 2012, Resolución 1632 de 2012 y Resolución 1807 de 2012, o la norma que la modifique o sustituya).\nb) Para fuentes fijas puntuales a las que no les aplique la medición directa por aspectos técnicos o de seguridad, y fuentes dispersas de área, aplicar métodos alternativos como factores de emisión y balance de masas, teniendo en cuenta las metodologías para el uso de factores de emisión desarrolladas por entidades oficiales, centros de investigación o academia (AP-42 Agencia de Protección Ambiental de los Estados Unidos US-EPA, National Pollutant Inventory - NPI, entre otras), las cuales están referenciadas en la Guía para la Elaboración de Inventarios de Emisiones Atmosféricas del MADS.\nc) Para fuentes móviles se podrán utilizar modelos de emisión de fuentes móviles (ej. IVE, MOBILE, MOVES y/o COPERT) combinados con variables locales (distancias viajadas por la flota, velocidades, etc.), o factores de emisión usados internacionalmente (EPA y Unión Europea). El aforo vehicular a realizar tiene como propósito la identificación de las fuentes móviles que transitan por las vías del proyecto o que se encuentran en el área de influencia. El levantamiento de información de la flota vehicular como mínimo deber ser de (ocho (8) horas / veinticuatro (24) horas continuas por día, en día hábil y festivo. Seleccionar de acuerdo con los horarios de construcción y operación aplicable al POA). Se deberá realizar la identificación y características del punto de aforo y la clasificación de los vehículos por peso y tipo de combustible. Se deberá presentar un informe con los resultados del inventario de fuentes y emisiones, y se deberá anexar las memorias de cálculos con la estimación de emisiones de los contaminantes considerados, los cálculos y suposiciones realizados.\nd) Presentar el inventario con y sin las eficiencias de las medidas de control en el cálculo de las emisiones. Para cada contaminante se deberá justificar las eficiencias de control con las respectivas evidencias documentales.\ne) Reportar la actualización en los respectivos Informes de Cumplimiento Ambiental - ICA, el cual contendrá como mínimo: Metodología empleada; Información georreferenciada de las fuentes; Tipo de fuente; Tipo combustible empleado; Consumo de combustible por cada fuente (nominal en base horaria y total acumulado anual); Tiempos de operación (horas/año); Sistemas de control de emisiones (discriminando sistema y tipo de contaminante); Porcentaje de eficiencia de los sistemas; Emisiones desagregadas  por actividad; Para fuentes fijas puntuales se requieren los datos de altura y diámetro de las chimeneas;  Identificar y presentar un análisis de las fuentes de emisiones atmosféricas del proyecto que se asocian con los contaminantes monitoreados a nivel de inmisión, especialmente para los contaminantes no criterio que puedan emitirse en las etapas de su desarrollo, con base información cuantitativa y cualitativa generada para el componente atmosférico, y otros medios y componentes; y fuentes de información utilizada.\nf) Anexar los archivos del inventario de fuentes diferenciando claramente la metodología y los cálculos (formatos accesibles .xls no protegidos), de las fuentes de contaminantes criterio y/o tóxicos (fijas puntuales y dispersas o difusas) con las consideraciones sobre la estimación."},{"$f":"PPII_YNC!F11","v":"N/A"},{"$f":"PPII_YNC!G11","v":"Aplica"},{"$f":"PPII_YNC!H11","v":"Aplica"},{"$f":"PPII_YNC!I11","v":"N/A"},{"$f":"PPII_YNC!J11","v":"N/A"},{"$f":"PPII_YNC!K11","v":"Permanente"}]
{"$rows_left_out":196}
{"sheet":"Asuntos radicación","index":3,"n_rows":63,"n_cols":4,"rows_kept":63,"cut":false,"hidden":false,"merged":[[0,0,0,3],[54,0,55,0],[4,0,5,0],[7,0,9,0],[7,2,9,2],[7,3,9,3],[20,0,21,0],[22,0,23,0],[25,0,27,0],[28,0,29,0],[31,0,32,0],[34,0,38,0],[39,0,47,0]]}
["Asuntos de radicación relacionados con la Obligación General \"Estrategia de recepción de información de los resultados de los monitoreos del uso y aprovechamiento de los recursos naturales\":"]
[]
["ASPECTO","TIPO","ABREVIATURA","ASUNTO"]
["OCUPACION DE CAUCE","NA","OCA",{"$f":"C4&\"-LAM/LAVXXXX-XX-XXXX\"","v":"OCA-LAM/LAVXXXX-XX-XXXX"}]
["CAPTACIÓN","SUPERFICIAL","CSP",{"$f":"C5&\"-LAM/LAVXXXX-XX-XXXX\"","v":"CSP-LAM/LAVXXXX-XX-XXXX"}]
[null,"SUBTERRANEA","CSB","CSB-LAM/LAVXXXX-XX-XXXX"]
{"$rows_left_out":58}
{"sheet":"Temp","index":4,"n_rows":170,"n_cols":4,"rows_kept":170,"cut":false,"hidden":true,"merged":[[0,0,0,3]]}
["ANEXO - OBLIGACIONES MÍNIMAS PARA [COLOCAR NOMBRE DEL PROYECTO]"]
["COMPONENTE","Fase de construcción","Fase de operación y mantenimiento","Fase de desmantelamiento y abandono"]
[{"$f":"IF(PPII_YNC!D91=\"SI\",PPII_YNC!B91,NA())","v":{"$error":"#N/A"}},{"$f":"IF(PPII_YNC!D91=\"SI\",PPII_YNC!#REF!,NA())","v":{"$error":"#N/A"}},{"$f":"IF(PPII_YNC!D91=\"SI\",PPII_YNC!#REF!,NA())","v":{"$error":"#N/A"}},{"$f":"IF(PPII_YNC!D91=\"SI\",'OBLIGACIONES APLICABLES'!#REF!,NA())","v":{"$error":"#N/A"}}]
[{"$f":"IF(PPII_YNC!D92=\"SI\",PPII_YNC!B92,NA())","v":{"$error":"#N/A"}},{"$f":"IF(PPII_YNC!D92=\"SI\",PPII_YNC!#REF!,NA())","v":{"$error":"#N/A"}},{"$f":"IF(PPII_YNC!#REF!=\"SI\",'OBLIGACIONES APLICABLES'!#REF!,NA())","v":{"$error":"#REF!"}},{"$f":"IF(PPII_YNC!#REF!=\"SI\",'OBLIGACIONES APLICABLES'!#REF!,NA())","v":{"$error":"#REF!"}}]
[{"$f":"IF(PPII_YNC!#REF!=\"SI\",PPII_YNC!#REF!,NA())","v":{"$error":"#REF!"}},{"$f":"IF(PPII_YNC!#REF!=\"SI\",PPII_YNC!#REF!,NA())","v":{"$error":"#REF!"}},{"$f":"IF(PPII_YNC!#REF!=\"SI\",'OBLIGACIONES APLICABLES'!#REF!,NA())","v":{"$error":"#REF!"}},{"$f":"IF(PPII_YNC!#REF!=\"SI\",'OBLIGACIONES APLICABLES'!#REF!,NA())","v":{"$error":"#REF!"}}]
[{"$f":"IF(PPII_YNC!#REF!=\"SI\",PPII_YNC!#REF!,NA())","v":{"$error":"#REF!"}},{"$f":"IF(PPII_YNC!#REF!=\"SI\",PPII_YNC!#REF!,NA())","v":{"$error":"#REF!"}},{"$f":"IF(PPII_YNC!#REF!=\"SI\",'OBLIGACIONES APLICABLES'!#REF!,NA())","v":{"$error":"#REF!"}},{"$f":"IF(PPII_YNC!#REF!=\"SI\",'OBLIGACIONES APLICABLES'!#REF!,NA())","v":{"$error":"#REF!"}}]
{"$rows_left_out":165}
{"sheet":"Hoja2","index":5,"n_rows":74,"n_cols":4,"rows_kept":74,"cut":false,"hidden":true,"merged":[]}
["COMPONENTE","Fase de construcción","Fase de operación y mantenimiento","Fase de desmantelamiento y abandono"]
[{"$f":"IFERROR(INDEX(Temp!A$3:A$170, SMALL(IF(ISERROR(Temp!A$3:A$170), \"\", ROW(Temp!A$3:A$170)-MIN(ROW(Temp!A$3:A$170))+1), ROW(1:1))),\"\")","v":""},{"$f":"IFERROR(INDEX(Temp!B$3:B$170, SMALL(IF(ISERROR(Temp!B$3:B$170), \"\", ROW(Temp!B$3:B$170)-MIN(ROW(Temp!B$3:B$170))+1), ROW(1:1))),\"\")","v":""},{"$f":"IFERROR(INDEX(Temp!C$3:C$170, SMALL(IF(ISERROR(Temp!C$3:C$170), \"\", ROW(Temp!C$3:C$170)-MIN(ROW(Temp!C$3:C$170))+1), ROW(1:1))),\"\")","v":""},{"$f":"IFERROR(INDEX(Temp!D$3:D$170, SMALL(IF(ISERROR(Temp!D$3:D$170), \"\", ROW(Temp!D$3:D$170)-MIN(ROW(Temp!D$3:D$170))+1), ROW(1:1))),\"\")","v":""}]
[{"$f":"IFERROR(INDEX(Temp!A$3:A$170, SMALL(IF(ISERROR(Temp!A$3:A$170), \"\", ROW(Temp!A$3:A$170)-MIN(ROW(Temp!A$3:A$170))+1), ROW(2:2))),\"\")","v":""},{"$f":"IFERROR(INDEX(Temp!B$3:B$170, SMALL(IF(ISERROR(Temp!B$3:B$170), \"\", ROW(Temp!B$3:B$170)-MIN(ROW(Temp!B$3:B$170))+1), ROW(2:2))),\"\")","v":""},{"$f":"IFERROR(INDEX(Temp!C$3:C$170, SMALL(IF(ISERROR(Temp!C$3:C$170), \"\", ROW(Temp!C$3:C$170)-MIN(ROW(Temp!C$3:C$170))+1), ROW(2:2))),\"\")","v":""},{"$f":"IFERROR(INDEX(Temp!D$3:D$170, SMALL(IF(ISERROR(Temp!D$3:D$170), \"\", ROW(Temp!D$3:D$170)-MIN(ROW(Temp!D$3:D$170))+1), ROW(2:2))),\"\")","v":""}]
[{"$f":"IFERROR(INDEX(Temp!A$3:A$170, SMALL(IF(ISERROR(Temp!A$3:A$170), \"\", ROW(Temp!A$3:A$170)-MIN(ROW(Temp!A$3:A$170))+1), ROW(3:3))),\"\")","v":""},{"$f":"IFERROR(INDEX(Temp!B$3:B$170, SMALL(IF(ISERROR(Temp!B$3:B$170), \"\", ROW(Temp!B$3:B$170)-MIN(ROW(Temp!B$3:B$170))+1), ROW(3:3))),\"\")","v":""},{"$f":"IFERROR(INDEX(Temp!C$3:C$170, SMALL(IF(ISERROR(Temp!C$3:C$170), \"\", ROW(Temp!C$3:C$170)-MIN(ROW(Temp!C$3:C$170))+1), ROW(3:3))),\"\")","v":""},{"$f":"IFERROR(INDEX(Temp!D$3:D$170, SMALL(IF(ISERROR(Temp!D$3:D$170), \"\", ROW(Temp!D$3:D$170)-MIN(ROW(Temp!D$3:D$170))+1), ROW(3:3))),\"\")","v":""}]
[{"$f":"IFERROR(INDEX(Temp!A$3:A$170, SMALL(IF(ISERROR(Temp!A$3:A$170), \"\", ROW(Temp!A$3:A$170)-MIN(ROW(Temp!A$3:A$170))+1), ROW(4:4))),\"\")","v":""},{"$f":"IFERROR(INDEX(Temp!B$3:B$170, SMALL(IF(ISERROR(Temp!B$3:B$170), \"\", ROW(Temp!B$3:B$170)-MIN(ROW(Temp!B$3:B$170))+1), ROW(4:4))),\"\")","v":""},{"$f":"IFERROR(INDEX(Temp!C$3:C$170, SMALL(IF(ISERROR(Temp!C$3:C$170), \"\", ROW(Temp!C$3:C$170)-MIN(ROW(Temp!C$3:C$170))+1), ROW(4:4))),\"\")","v":""},{"$f":"IFERROR(INDEX(Temp!D$3:D$170, SMALL(IF(ISERROR(Temp!D$3:D$170), \"\", ROW(Temp!D$3:D$170)-MIN(ROW(Temp!D$3:D$170))+1), ROW(4:4))),\"\")","v":""}]
[{"$f":"IFERROR(INDEX(Temp!A$3:A$170, SMALL(IF(ISERROR(Temp!A$3:A$170), \"\", ROW(Temp!A$3:A$170)-MIN(ROW(Temp!A$3:A$170))+1), ROW(5:5))),\"\")","v":""},{"$f":"IFERROR(INDEX(Temp!B$3:B$170, SMALL(IF(ISERROR(Temp!B$3:B$170), \"\", ROW(Temp!B$3:B$170)-MIN(ROW(Temp!B$3:B$170))+1), ROW(5:5))),\"\")","v":""},{"$f":"IFERROR(INDEX(Temp!C$3:C$170, SMALL(IF(ISERROR(Temp!C$3:C$170), \"\", ROW(Temp!C$3:C$170)-MIN(ROW(Temp!C$3:C$170))+1), ROW(5:5))),\"\")","v":""},{"$f":"IFERROR(INDEX(Temp!D$3:D$170, SMALL(IF(ISERROR(Temp!D$3:D$170), \"\", ROW(Temp!D$3:D$170)-MIN(ROW(Temp!D$3:D$170))+1), ROW(5:5))),\"\")","v":""}]
{"$rows_left_out":68}